{"text_format":"1","workbook":"xlsx","n_sheets":2,"sheets":["podpořené","nepodpořené"],"not_rendered":{"charts":0,"images":0,"macros":1,"external_links":0,"defined_names":2,"comments":0,"pivot_tables":0},"unopened":[],"bounds":{"document_bytes":16777216,"sheet_cells":100000,"rows_first":2000,"rows_last":500,"rows_between":2000,"halvings":0,"cell_chars":16384,"cell_head_chars":4096},"cells_cut":0,"cells_raw":0,"read":"whole","date_system":"1900"}

{"sheet":"podpořené","index":0,"n_rows":205,"n_cols":48,"rows_kept":205,"cut":false,"hidden":false,"merged":[[5,5,6,5],[5,22,5,26],[5,0,6,0],[5,3,6,3],[5,4,6,4],[5,7,6,7],[5,13,6,13],[5,14,6,14],[5,2,6,2],[5,1,6,1],[5,27,6,27],[5,6,6,6],[5,8,6,8],[5,9,5,10],[5,11,5,12],[5,16,6,16],[5,17,5,21],[5,28,6,28],[5,30,6,30],[5,31,6,31],[5,32,6,32],[5,33,6,33],[5,47,6,47],[5,34,6,34],[5,35,6,35],[5,36,6,36],[5,37,6,37],[5,43,6,43],[5,45,6,45],[5,46,6,46],[5,44,6,44],[5,38,6,38],[5,39,6,39],[5,40,6,40],[5,41,6,41],[5,42,6,42]]}
["Hodnotící formulář - souhrnná tabulka projektů"]
["Číslo a název oblasti podpory, programu: č.1 oblast podpory Požární ochrana a prevence kriminality, program č. 1.1 Podpora jednotek požární ochrany obcí Libereckého kraje"]
["Rok vyhlášení: 2025"]
["Projekty navržené k podpoře"]
[]
["P. č. ","Obec/město\n","Žadatel","Název projektu","Popis projektu\n(účel projektu)","č. účelu","Výstupy projektu","Výstupy projektu\npo úpravách","Celk.\nvýdaje projektu Kč","Požadovaná výše dotace",null,"Vlastní zdroje příjemce",null,"Celk.\nvýdaje projektu Kč\npo úpravách","Výše dotace v Kč\npo úpravách","procento po úpravách","Admin. soulad (projekt je v souladu s účelem a podmínkami programu, je způsobilý pro další hodnocení) ANO/NE","Závazná kritéria hodnocení                 (body) /  %",null,null,null,null,"Spec. kritéria hodnocení              (body)  /  %",null,null,null,null,"Celk. počet bodů","OLP",null,"Ulice","Adresa","PSČ","Jmeno starosty","Pohlaví","IČ","DIČ","Číslo účtu","HK_Celková_výdaje_text","HK_Dotace_LK_text","HK_Dotace_ slovy","HK_procento-100% nebo 90% ","HK_Procento LK dotace","HK_Procento vlastní zdroje","VS","číslo usnesení","datum ZK","Kontrola délky textu"]
[null,null,null,null,null,null,null,null,null,"Kč","%","Kč","%",null,null,"%",null,"\n1\n",0.3,"\n2\n",0.1,"Σz ",3,0.1,4,0.5,"Σs  "]
[164,"Obec","Benešov u Semil","Obnova dýchací techniky pro JPO III Benešov u Semil","Účelem projektu je pořízení dvou kusů vzduchových přetlakových přístrojů MSA M1 SCB pro JPO III Benešov u Semil, pro zásahy spojené s využitím dýchací techniky - U6).","6c","Vzduchový přetlakový přístroj MSA M1 SCB - 2 ks","Vzduchový přetlakový přístroj MSA M1 SCB - 2 ks",52702,31600,{"$f":"ROUND(J8/I8*100,2)","v":59.96},{"$f":"I8-J8","v":21102},{"$f":"ROUND(L8/I8*100,2)","v":40.04},52702,31600,{"$f":"ROUND(O8/N8*100,2)","v":59.96},"ANO",15,{"$f":"R8*0.3","v":4.5},{"$f":"IF(K8<=30,\"15\",IF(K8<=50,\"7\",IF(K8<=70,\"0\",\"!!!\")))","v":"0"},{"$f":"T8*0.1","v":0},{"$f":"S8+U8","v":4.5},15,{"$f":"W8*0.1","v":1.5},7,{"$f":"Y8*0.5","v":3.5},{"$f":"X8+Z8","v":5},{"$f":"V8+AA8","v":9.5},"OLP/02024/2025",null,"125","Benešov u Semil","51206",{"$f":"_xlfn.XLOOKUP(C8,#REF!,#REF!,\"Nenalezeno!\")","v":{"$error":"#REF!"}},"starostka","00275590","CZ00275590","1263110329/0800",{"$f":"TEXT(N8,\"# ##0 Kč\")","v":"52 702 Kč"},{"$f":"TEXT(O8,\"# ##0,00 Kč\")","v":"31 600,00 Kč"},{"$f":"Slovy(O8)","v":"třicet jedentisíc šestset"},{"$f":"IF(O8<=300000,\"100%\",\"90%\")","v":"100%"},{"$f":"TEXT(P8,\"0,00\")& \"%\"","v":"59,96%"},{"$f":"TEXT(M8,\"0,00\")& \"%\"","v":"40,04%"},null,null,null,{"$f":"LEN(H8)","v":47}]
[168,"Obec","Benešov u Semil","Pořízení, obnova a doplnění vybavení JPO III Benešov u Semil","Účelem projektu je pořízení a obnova věcných prostředků požární ochrany - ochraných přileb. Vybavení je určeno pro JPO III Benešov u Semil. Nevyhovující kusy vybavení je třeba nahradit novými věcnými prostředky. U2)",2,"Přilba MSA Gallet F1xF Gold+ - 2ks","Přilba MSA Gallet F1xF Gold+ - 2ks",26596,15900,59.78,10696,40.22,26596,15900,59.78,"ANO",15,4.5,"0",0,4.5,15,1.5,15,7.5,9,13.5,"OLP/02028/2025",null,"125","Benešov u Semil","51206",{"$f":"_xlfn.XLOOKUP(C9,#REF!,#REF!,\"Nenalezeno!\")","v":{"$error":"#REF!"}},"starostka","00275590","CZ00275590","1263110329/0800","26 596 Kč","15 900,00 Kč",{"$f":"Slovy(O9)","v":"patnáct tisíc devětset"},"100%","59,78%","40,22%",null,null,null,34]
[163,"Obec","Bílá","Pořízení a obnova ochranných prostředků požární ochrany","Obec Bílá se na základě žádosti velitele jednotky obce rozhodla pokračovat v pořizování a obnově dalších ochranných prostředků pro zasahující hasiče. Důvod pořízení je vybavování nových členů jednotky a staří a opotřebování těchto prostředků.",2,"Zásahový oblek FireRexClasic FR3-kompletinvestiční - 4 ks, Nápis reflexní Hasiči Bílá - pro zásahové obleky\nGoodPRO - 4 ks, Kukla otvor - obličej - NOMEX - DEVA - 4 ks, Přilba zásahová Heros Titan - Rosenbauer- signální\nžlutá - 4 ks, Svítilna integrovaná LED pro přilbu Heros Titan - 4 ks, Zásahová obuv Fire Hero 3 - 4 ks","Zásahový oblek FireRexClasic FR3-kompletinvestiční - 4 ks, Nápis reflexní Hasiči Bílá - pro zásahové obleky\nGoodPRO - 4 ks, Kukla otvor - obličej - NOMEX - DEVA - 4 ks, Přilba zásahová Heros Titan - Rosenbauer- signální\nžlutá - 4 ks, Svítilna integrovaná LED pro přilbu Heros Titan - 4 ks, Zásahová obuv Fire Hero 3 - 4 ks",174800,87400,50,87400,50,174800,87400,50,"ANO",7,2.1,"7",0.70000000000000007,2.8000000000000003,15,1.5,15,7.5,9,11.8,"OLP/02023/2025",null,"76","Bílá","46343",{"$f":"_xlfn.XLOOKUP(C10,#REF!,#REF!,\"Nenalezeno!\")","v":{"$error":"#REF!"}},"starosta","00262668",null,"63229574/0600","174 800 Kč","87 400,00 Kč",{"$f":"Slovy(O10)","v":"osmdesát sedmtisíc čtyřista"},"100%","50,00%","50,00%",null,null,null,322]
[131,"Obec","Bílý Kostel nad Nisou","Pořízení prostředků požární ochrany - U4","U4) Pořízení, obnova, doplnění a opravy věcných prostředků požární ochrany pro čerpání vody zejména v souvislosti se záplavami a povodněmi",4,"Heron elektrocentrála benzínová 13HP/6,0kW (400V), 2x2,2kW (230V) - 1 ks, Ponorné kalové čerpadlo Rössle MEGA - 1 ks, Čerpadlo plovoucí POSEIDON 1200 Honda GCVx200 - 1 ks","Heron elektrocentrála benzínová 13HP/6,0kW (400V), 2x2,2kW (230V) - 1 ks, Ponorné kalové čerpadlo Rössle MEGA - 1 ks",85977,60000,69.790000000000006,25977,30.21,45187,31536,69.790000000000006,"ANO                              plovoucí čerpadlo Poseidon 1200 nesplňuje požadavek na minimální průtok 1500 l/min",7,2.1,"0",0,2.1,15,1.5,15,7.5,9,11.1,"OLP/01991/2025",null,"206","Bílý Kostel nad Nisou","46331",{"$f":"_xlfn.XLOOKUP(C11,#REF!,#REF!,\"Nenalezeno!\")","v":{"$error":"#REF!"}},"starosta","00672106","CZ00672106","94-217461/0710","45 187 Kč","31 536,00 Kč",{"$f":"Slovy(O11)","v":"třicet jedentisíc pětset třicet šest"},"100%","69,79%","30,21%",null,null,null,116]
[133,"Obec","Bílý Kostel nad Nisou","Pořízení prostředků požární ochrany - U6a","U6) Pořízení, obnova, doplnění, opravy a výstavba:\na)pořízení, obnova, doplnění a opravy věcných prostředků požární ochrany, ochranných prostředků k\nprovádění speciálních činností při zásazích v souvislosti s mimořádnými událostmi","6c","Hadice C52 s konc./20m PH zásah Fire Gold - 10 ks, Hadice B65 s konc./20m PH Fire\nOrange Al - 10 ks","Hadice C52 s konc./20m PH zásah Fire Gold - 10 ks, Hadice B65 s konc./20m PH Fire\nOrange Al - 10 ks",81213,56500,69.569999999999993,24713,30.43,81213,56500,69.569999999999993,"ANO",7,2.1,"0",0,2.1,15,1.5,7,3.5,5,7.1,"OLP/01994/2025",null,"206","Bílý Kostel nad Nisou","46331",{"$f":"_xlfn.XLOOKUP(C12,#REF!,#REF!,\"Nenalezeno!\")","v":{"$error":"#REF!"}},"starosta","00672106","CZ00672106","94-217461/0710","81 213 Kč","56 500,00 Kč",{"$f":"Slovy(O12)","v":"padesát šesttisíc pětset"},"100%","69,57%","30,43%",null,null,null,99]
[134,"Obec","Bílý Kostel nad Nisou","Pořízení prostředků požární ochrany – U6c","U6) Pořízení, obnova, doplnění, opravy a výstavba:\nc)pořízení, obnova, doplnění a opravy věcných prostředků požární ochrany mimo prostředků uvedených v U5) a U6)a)","6c","Přejezdový můstek - gumový 2xB - 2 ks, Proudnice kombinovaná TurboSupon 500 C52 - 2 ks, Rozdělovač B-CBC s kulovými uzávěry TKW - 1 ks, Savice 2,5m se šroubením Profi - (žlutá) + prodlouž. Šr - 4 ks, Sekeromotyka 2 kg - 2 ks, Fiskars X25 silná štípací sekera na dřevo - 1 ks, Lopatka dřevorubecká - malá - 1 ks, Koš sací PH - prodloužený náběh s motýlkem - 1 ks, Deska páteřní s popruhem - 1 ks, Lékárnička – Batoh vybavený dle vyhlášky 53/2010 III - 1 ks, Pila STIHL MS 362 C-M VW - 1 ks, Terč zastavovací svítící TCP01 - 1 ks, Kužel teleskopický svítící 450 mm - 3 ks, Lano ventilové 8x25 s karabinou - 2 ks, Upínací pás - popruh 5t 12 m×5 cm - 2 ks, Kleště štípací na tyče a svorníky 930 mm, průměr 13 mm - 1 ks, Sekera hasičská 2320 2,2kg - 1 ks, Sekera hasičská 2318 - 1 ks, Palice kovová 3 kg - 1 ks, Hák požární Al - 2 ks, Džberová stříkačka ruční plastová CTIF - 1 ks, Klíč 110/75 - 4 ks, Lano Static 11 barevné - 1 ks, Proudnice pěnotvorná S4 TKW bez uzávěru - 1 ks, Prodlužovací kabel na bubnu 20 m / 4 zásuvky / červený / PVC / 230 V / 1 mm2 - 1 ks, Přechod A110/B75 - 1 ks, Přechod C52/D25 kovaný - 1 ks, Hasicí přístroj práškový P6PMST 34A 6kg - 1 ks, Přiměšovač AWG Z4 - 1 ks, Savice přiměšovače D25 / 1,5m - 1 ks, Sběrač S110 a 2x B75 - 1 ks","Přejezdový můstek - gumový 2xB - 2 ks, Proudnice kombinovaná TurboSupon 500 C52 - 2 ks, Rozdělovač B-CBC s kulovými uzávěry TKW - 1 ks, Savice 2,5m se šroubením Profi - (žlutá) + prodlouž. Šr - 4 ks, Sekeromotyka 2 kg - 2 ks, Fiskars X25 silná štípací sekera na dřevo - 1 ks, Lopatka dřevorubecká - malá - 1 ks, Koš sací PH - prodloužený náběh s motýlkem - 1 ks, Deska páteřní s popruhem - 1 ks, Lékárnička – Batoh vybavený dle vyhlášky 53/2010 III - 1 ks, Pila STIHL MS 362 C-M VW - 1 ks, Terč zastavovací svítící TCP01 - 1 ks, Kužel teleskopický svítící 450 mm - 3 ks, Lano ventilové 8x25 s karabinou - 2 ks, Upínací pás - popruh 5t 12 m×5 cm - 2 ks, Kleště štípací na tyče a svorníky 930 mm, průměr 13 mm - 1 ks, Sekera hasičská 2320 2,2kg - 1 ks, Sekera hasičská 2318 - 1 ks, Palice kovová 3 kg - 1 ks, Hák požární Al - 2 ks, Džberová stříkačka ruční plastová CTIF - 1 ks, Klíč 110/75 - 4 ks, Lano Static 11 barevné - 1 ks, Proudnice pěnotvorná S4 TKW bez uzávěru - 1 ks, Prodlužovací kabel na bubnu 20 m / 4 zásuvky / červený / PVC / 230 V / 1 mm2 - 1 ks, Přechod A110/B75 - 1 ks, Přechod C52/D25 kovaný - 1 ks, Hasicí přístroj práškový P6PMST 34A 6kg - 1 ks, Přiměšovač AWG Z4 - 1 ks, Savice přiměšovače D25 / 1,5m - 1 ks, Sběrač S110 a 2x B75 - 1 ks",125314,75000,59.85,50314,40.15,125314,75000,59.85,"ANO",7,2.1,"0",0,2.1,15,1.5,7,3.5,5,7.1,"OLP/01995/2025",null,"206","Bílý Kostel nad Nisou","46331",{"$f":"_xlfn.XLOOKUP(C13,#REF!,#REF!,\"Nenalezeno!\")","v":{"$error":"#REF!"}},"starosta","00672106","CZ00672106","94-217461/0710","125 314 Kč","75 000,00 Kč",{"$f":"Slovy(O13)","v":"sedmdesát pěttisíc"},"100%","59,85%","40,15%",null,null,null,1256]
[171,"Obec","Bozkov","Pořízení navijáku pro JSDH Bozkov ","U6,c)pořízení, obnova, doplnění a opravy věcných prostředků požární ochrany mimo prostředků uvedených v U5) a U6)a).","6b","Naviják pro DA - 1 ks","Naviják pro DA - 1 ks",77755,46653,60,31102,40,77755,46653,60,"ANO",7,2.1,"0",0,2.1,15,1.5,7,3.5,5,7.1,"OLP/02032/2025",null,"270","Bozkov","51213",{"$f":"_xlfn.XLOOKUP(C14,#REF!,#REF!,\"Nenalezeno!\")","v":{"$error":"#REF!"}},"starosta","00275611","CZ00275611","94-50313451/0710","77 755 Kč","46 653,00 Kč",{"$f":"Slovy(O14)","v":"čtyřicet šesttisíc šestset padesát tři"},"100%","60,00%","40,00%",null,null,null,21]
[37,"Obec","Brniště","Pořízení věcných prostředků","Pořízení potřebného vybavení pro JSDH Brniště","6c","motykohrábě - 2 ks, Svítilna PARAT PX1 LED Ex - 10 ks, čerpadlo kalové HERON EMPH 80W SET se sacím\nkošem s klapkou - 1 ks, opasek polohovací pro hasiče - FIREMAN s\nrychlosponou Q-RS - 4 ks, držák svítilny PX1 pro přilbu DRAEGER HPS\n3500/SICOR EOM - 10 ks","motykohrábě - 2 ks, Svítilna PARAT PX1 LED Ex - 10 ks, čerpadlo kalové HERON EMPH 80W SET se sacím\nkošem s klapkou - 1 ks, opasek polohovací pro hasiče - FIREMAN s\nrychlosponou Q-RS - 4 ks, držák svítilny PX1 pro přilbu DRAEGER HPS\n3500/SICOR EOM - 10 ks",66891,33445,50,33446,50,66891,33445,50,"ANO",15,4.5,"7",0.70000000000000007,5.2,15,1.5,7,3.5,5,10.199999999999999,"OLP/01911/2025",null,"102","Brniště","47129",{"$f":"_xlfn.XLOOKUP(C15,#REF!,#REF!,\"Nenalezeno!\")","v":{"$error":"#REF!"}},"starosta","00260401",null,"94-517421/0710","66 891 Kč","33 445,00 Kč",{"$f":"Slovy(O15)","v":"třicet třitisíce čtyřista čtyřicet pět"},"100%","50,00%","50,00%",null,null,null,254]
{"$rows_left_out":191}
{"sheet":"nepodpořené","index":1,"n_rows":44,"n_cols":24,"rows_kept":44,"cut":false,"hidden":false,"merged":[[1,19,2,19],[1,20,2,20],[1,21,2,21],[1,22,2,22],[1,23,2,23],[1,18,2,18],[1,0,2,0],[1,1,2,1],[1,2,2,2],[1,3,2,3],[1,4,2,4],[1,5,2,5],[1,6,2,6],[1,7,2,7],[1,8,2,8],[1,9,1,10],[1,11,1,12]]}
["Projekty navržené k vyřazení z důvodu nesplnění podmínek programu"]
["P. č. ","Obec/město\n","Žadatel","Název projektu","Popis projektu\n(účel projektu)","č. účelu","Výstupy projektu","Admin. soulad (projekt je v souladu s účelem a podmínkami programu, je způsobilý pro další hodnocení) ANO/NE","Celk.\nvýdaje projektu Kč","Požadovaná výše dotace",null,"Vlastní zdroje příjemce",null,"IČ","DIČ","Ulice","Město","PSČ","HK_Celkové_výdaje_projektu_LK_text","HK_LK_Dotace_ slovy","HK_Procento LK dotace","IČ","Kontrola délky textu","Kontrola délky parametrů"]
[null,null,null,null,null,null,null,null,null,"Kč","%","Kč","%"]
[257,"Město","Cvikov","Město Cvikov pro JSDH Cvikov 2 ks nových norných stěn ptro zachycení nebezpečných látek na vodní hladině a tekoucí vodě.\n","U3) Město Cvikov pro JSDH Cvikov 2 ks nových norných stěn RV 5m pro zachycení nebezpečných látek na vodní hladině a tekoucí vodě. Jedná se o výměnu zařízení, které již dosloužilo.",3,"norná stěna RV 5m - 2 KS","NE\nbez časového razítka, chybí povinná příloha (podrobný popis projektu)",33568,23496,{"$f":"ROUND(J4/I4*100,2)","v":70},{"$f":"I4-J4","v":10072},{"$f":"ROUND(L4/I4*100,2)","v":30},"00260410","CZ00260410","Náměstí Osvobození 63","Cvikov","47154",{"$f":"TEXT(I4,\"# ##0,00 Kč\")","v":"33 568,00 Kč"},{"$f":"TEXT(J4,\"# ##0 Kč\")","v":"23 496 Kč"},{"$f":"TEXT(M4,\"0,00\")& \"%\"","v":"30,00%"},"00260410",{"$f":"LEN(E4)","v":179},{"$f":"LEN(G4)","v":24}]
[255,"Město","Cvikov","Město Cvikov pořizuje pro JSDH Cvikov řetězovou pilu Husqvarna 372XP. \n","Město Cvikov pořižuje pro JSDH Cvikov řetězovou pilu Husqvarna 372XP","6c","Řetězová pila Husqvarna 372XP - 1 ks","NE\nbez časového razítka, chybí povinná příloha (podrobný popis projektu)",27499,16499,60,11000,40,"00260410","CZ00260410","Náměstí Osvobození 63","Cvikov","47154","27 499,00 Kč","16 499 Kč","40,00%","00260410",{"$f":"LEN(E5)","v":68},{"$f":"LEN(G5)","v":36}]
[256,"Město","Cvikov","Nákup 8ks zásahových ochranných jednovrstvých kompletů FR2 FireSnake-classic a 8 ks nášivek s vlastním motivem na zásahové kabáty GoodPRO \n","U2) Město Cvikov požizuje pro členy JSDH Cvikov zásahové komplety s nášivkami v rámci obměny vybavení jednotky.\nNENÍ ČASOVÉ RAZÍTKO A PODROBNÝ POSIS",2,"zásahový ochranný jednovrstvý komplet FR2 FireSnake-classic - 8 KS, reflexní nášivka s vlastním motivem na zásahové\nkabáty GoodPRO - 8 KS","NE\nbez časového razítka, chybí povinná příloha (podrobný popis projektu)",79280,47568,60,31712,40,"00260410","CZ00260410","Náměstí Osvobození 63","Cvikov","47154","79 280,00 Kč","47 568 Kč","40,00%","00260410",148,137]
[258,"Město","Cvikov","Město Cvikov v rámci vybavení JSDH Cvikov pořizuje 4 ks přenosných digitálních radiostanic Motorola DP2400E VHF  s externím mikrofonem/reproduktorem pro RDST\n","U6c) Město Cvikov v rámci vybavení JSDH Cvikov pořizuje 4 ks přenosných digitálních radiostanic Motorola DP2400E VHF s externím mikrofonem/reproduktorem pro RDST","6c","přenosná dig. radiostanice Motorola DP2400E VHF - 4 ks, mikrofon/reproduktor pro radiostanice DP2400E - 4 ks","NE\nbez časového razítka, chybí povinná příloha (podrobný popis projektu)",69504,41702,60,27802,40,"00260410","CZ00260410","Náměstí Osvobození 63","Cvikov","47154","69 504,00 Kč","41 702 Kč","40,00%","00260410",161,108]
[88,"Město","Česká Lípa","\"Nákup věcných prostředků PO - JSDHO Stará Lípa\"","Projekt bude využit na nákup a doplnění ochranných prostředků požární ochrany, který je nezbytně nutný pořídit z důvodu předurčenosti jednotky v zařazení JPO II/I, dle poplachových plánů LK","6c","Rescue hood PSS - záchranná vyváděcí kukla - 2 ks, Maska FPS 7730 M2-P-PC-EPDM, kandahár S-fix uni - 4 ks, Láhev kompozit 6,8/300bar, ventil Dräger EFV+potah\nna láhev L65B - 2 ks, Plicní automatika PSS-P (přetlak, krátká hadice) - 1 ks, Držák plicní automatiky pro AirBoss s fix upínáním - 1 ks","NE\nVyřazeno na žádost žadatele (více žádostí v účelu U6 (max 2 žádosti)",102676,51000,49.67,51676,50.33,"00260428","CZ00260428","náměstí T. G. Masaryka 1/1","Česká Lípa","47001","102 676,00 Kč","51 000 Kč","50,33%",260428,189,294]
[91,"Město","Česká Lípa","\"Pořízení, obnova věcných prostředků PO pro JSDHO Stará Lípa\"","Projekt bude využit na doplnění věcných prostředků požární ochrany, ochranných prostředků z důvodu předurčenosti jednotky v zařazení JPO II/I, dle poplachových plánů LK.","6c","SUNIT IV FK - lehký protichemický oblek - 2 ks, Hlásič - detektor plynů GasAlert MicroClip X3 - 4\nplyny - 1 ks, Ruční radiostanice MOTOROLA DP 2600e s externím\nmikrofonem a vozidlovou nabíječkou MOTOROLA pro\nDP 2000e (12-24V) - 4 ks","NE\nVyřazeno na žádost žadatele (více žádostí v účelu U6 (max 2 žádosti)",141290,70000,49.54,71290,50.46,"00260428","CZ00260428","náměstí T. G. Masaryka 1/1","Česká Lípa","47001","141 290,00 Kč","70 000 Kč","50,46%",260428,169,232]
[173,"Obec","Dalešice","Obnova osobních ochranných prostředků \n","U2) Pořízení, obnova, doplnění a opravy v závorce vyjmenovaných osobních ochranných prostředků požární ochrany (jednovrstvé a vícevrstvé zásahové obleky, zásahové boty, zásahové rukavice, zásahové přilby, polohovací opasky pro hasiče ......)",2,"jednovrstvé zásahové obleky - 4 ks, zásahové boty - 4 ks, zásahové přilby - 4 ks","NE\nNeplatný podpis",98400,49100,49.9,49300,50.1,"43256201",null,"67","Dalešice","46802","98 400,00 Kč","49 100 Kč","50,10%","43256201",241,80]
[228,"Město","Doksy","1.1 Podpora jednotek požární ochrany obcí Libereckého kraje","U5 Pořízení, obnova, doplnění a opravy věcných prostředků požární ochrany pro zásahy v souvislosti s likvidací lesních požárů",5,"přilba pro hasiče F2XR pro lesní požáry - 8 ks","NE\nna 1 organizovaný výjezd lze pořídit pouze 4 ks příleb; po úpravě výše dotace není minimálně 15000 Kč",46848,23450,50.06,23398,49.94,"00260444","CZ00260444","náměstí Republiky 193","Doksy","47201","46 848,00 Kč","23 450 Kč","49,94%","00260444",125,46]
[254,"Město","Hejnice","Oprava povrchu podlah garážových stání hasičské zbrojnice Hejnice\n","Účelem projektu je rekonstrukce povrchu podlah garážových stání pro výjezdovou techniku JSDH Hejnice v objektu čp. 593, jenž bude realizována jako Protiskluzová epoxid-křemičitá podlahová konstrukce (třívrstvá), vč. obvodového soklu","6f","rekonstruovaná podlaha hasičárny - 153 m2 \n","NE\nmax výše dotace 60%",160000,112000,70,48000,30,"00262803","CZ00262803","Nádražní 521","Hejnice","46362","160 000,00 Kč","112 000 Kč","30,00%","00262803",232,43]
[181,"Město","Hodkovice nad Mohelkou","Věcné prostředky požární ochrany","Zvýšení akceschopnosti jednotky sboru dobrovolných hasičů ","6c","detektor pohybu hasiče - 2 ks, vysavač na vodu Rosle - 1 ks, Led modul X - Flare - 1 ks","NE\nvysavač nesplňuje minimálníprůtok 22000 lúhod pro účel U5), pro účel U6c) nelze použít výši dotace 70 %",48668,34067,70,14601,30,"00262820","CZ00262820","nám. T. G. Masaryka 1","Hodkovice nad Mohelkou","46342","48 668,00 Kč","34 067 Kč","30,00%","00262820",58,87]
[264,"Město","Jilemnice","Doplnění  věcných prostředků - lahve\n","U3 - Doplnění věcných prostředků - lahve ",3,"láhev tlaková kompozitní carbon 6,8 l/30 Mpa DRAEGER - 4 ks","NE\nbez časového razítka, chybí povinná příloha (podrobný popis projektu)",72504,43000,59.31,29504,40.69,"00275808","CZ00275808","Masarykovo náměstí 82","Jilemnice","51401","72 504,00 Kč","43 000 Kč","40,69%","00275808",41,59]
[265,"Město","Jilemnice","Doplnění a obnova věcných prostředků - lesní požáry\n","U5-Doplnění a obnova věcných prostředků - lesní požáry",5,"Program D25 PROLINE a sbatohem BAG 4H - 1 ks, Vazák hadice 1,6 m - 6 ks, Obuv HAIX Fire flash 2,0 - 4 ks","NE\nbez časového razítka, chybí povinná příloha (podrobný popis projektu)",67526,40000,59.24,27526,40.76,"00275808","CZ00275808","Masarykovo náměstí 82","Jilemnice","51401","67 526,00 Kč","40 000 Kč","40,76%","00275808",54,104]
{"$rows_left_out":29}